<?xml version="1.0" encoding="UTF-8"?><rss version="2.0"
	xmlns:content="http://purl.org/rss/1.0/modules/content/"
	xmlns:dc="http://purl.org/dc/elements/1.1/"
	xmlns:atom="http://www.w3.org/2005/Atom"
	xmlns:sy="http://purl.org/rss/1.0/modules/syndication/"
	
	>
<channel>
	<title>
	Comments on: How to solve error &#8220;FAILURE:Build failed with an exception&#8221; in android studio?	</title>
	<atom:link href="https://www.bestdevops.com/how-to-solve-error-failurebuild-failed-with-an-exception-in-android-studio/feed/" rel="self" type="application/rss+xml" />
	<link>https://www.bestdevops.com/how-to-solve-error-failurebuild-failed-with-an-exception-in-android-studio/</link>
	<description>Lets Learn, Do it &#38; Share! Thats a Best DevOps!!!</description>
	<lastBuildDate>Sat, 01 Feb 2025 06:36:09 +0000</lastBuildDate>
	<sy:updatePeriod>
	hourly	</sy:updatePeriod>
	<sy:updateFrequency>
	1	</sy:updateFrequency>
	<generator>https://wordpress.org/?v=7.1.3</generator>
	<item>
		<title>
		By: dharshini		</title>
		<link>https://www.bestdevops.com/how-to-solve-error-failurebuild-failed-with-an-exception-in-android-studio/#comment-4091</link>

		<dc:creator><![CDATA[dharshini]]></dc:creator>
		<pubDate>Sat, 01 Feb 2025 06:36:09 +0000</pubDate>
		<guid isPermaLink="false">https://www.bestdevops.com/?p=28388#comment-4091</guid>

					<description><![CDATA[FAILURE: Build failed with an exception.

* What went wrong:
A problem occurred configuring root project &#039;android&#039;.
&#062; Could not resolve all files for configuration &#039;:classpath&#039;.
&#160;&#160;&#062; Could not find com.android.tools.build:gradle:8.3.
&#160;&#160;&#160;Searched in the following locations:
&#160;&#160;&#160;&#160;- https://dl.google.com/dl/android/maven2/com/android/tools/build/gradle/8.3/gradle-8.3.pom
&#160;&#160;&#160;&#160;- https://repo.maven.apache.org/maven2/com/android/tools/build/gradle/8.3/gradle-8.3.pom
&#160;&#160;&#160;Required by:
&#160;&#160;&#160;&#160;&#160;project :
&#160;&#160;&#062; Could not find org.jetbrains.kotlin:kotlin-gradle-plugin:41.9.10.
&#160;&#160;&#160;Searched in the following locations:
&#160;&#160;&#160;&#160;- https://dl.google.com/dl/android/maven2/org/jetbrains/kotlin/kotlin-gradle-plugin/41.9.10/kotlin-gradle-plugin-41.9.10.pom
&#160;&#160;&#160;&#160;- https://repo.maven.apache.org/maven2/org/jetbrains/kotlin/kotlin-gradle-plugin/41.9.10/kotlin-gradle-plugin-41.9.10.pom
&#160;&#160;&#160;Required by:
&#160;&#160;&#160;&#160;&#160;project :

* Try:
&#062; Run with --stacktrace option to get the stack trace.
&#062; Run with --info or --debug option to get more log output.
&#062; Run with --scan to get full insights.
&#062; Get more help at https://help.gradle.org.

BUILD FAILED in 40s
Error: Gradle task assembleDebug failed with exit code 1]]></description>
			<content:encoded><![CDATA[<p>FAILURE: Build failed with an exception.</p>
<p>* What went wrong:<br />
A problem occurred configuring root project &#8216;android&#8217;.<br />
&gt; Could not resolve all files for configuration &#8216;:classpath&#8217;.<br />
&nbsp;&nbsp;&gt; Could not find com.android.tools.build:gradle:8.3.<br />
&nbsp;&nbsp;&nbsp;Searched in the following locations:<br />
&nbsp;&nbsp;&nbsp;&nbsp;&#8211; <a href="https://dl.google.com/dl/android/maven2/com/android/tools/build/gradle/8.3/gradle-8.3.pom" rel="nofollow ugc">https://dl.google.com/dl/android/maven2/com/android/tools/build/gradle/8.3/gradle-8.3.pom</a><br />
&nbsp;&nbsp;&nbsp;&nbsp;&#8211; <a href="https://repo.maven.apache.org/maven2/com/android/tools/build/gradle/8.3/gradle-8.3.pom" rel="nofollow ugc">https://repo.maven.apache.org/maven2/com/android/tools/build/gradle/8.3/gradle-8.3.pom</a><br />
&nbsp;&nbsp;&nbsp;Required by:<br />
&nbsp;&nbsp;&nbsp;&nbsp;&nbsp;project :<br />
&nbsp;&nbsp;&gt; Could not find org.jetbrains.kotlin:kotlin-gradle-plugin:41.9.10.<br />
&nbsp;&nbsp;&nbsp;Searched in the following locations:<br />
&nbsp;&nbsp;&nbsp;&nbsp;&#8211; <a href="https://dl.google.com/dl/android/maven2/org/jetbrains/kotlin/kotlin-gradle-plugin/41.9.10/kotlin-gradle-plugin-41.9.10.pom" rel="nofollow ugc">https://dl.google.com/dl/android/maven2/org/jetbrains/kotlin/kotlin-gradle-plugin/41.9.10/kotlin-gradle-plugin-41.9.10.pom</a><br />
&nbsp;&nbsp;&nbsp;&nbsp;&#8211; <a href="https://repo.maven.apache.org/maven2/org/jetbrains/kotlin/kotlin-gradle-plugin/41.9.10/kotlin-gradle-plugin-41.9.10.pom" rel="nofollow ugc">https://repo.maven.apache.org/maven2/org/jetbrains/kotlin/kotlin-gradle-plugin/41.9.10/kotlin-gradle-plugin-41.9.10.pom</a><br />
&nbsp;&nbsp;&nbsp;Required by:<br />
&nbsp;&nbsp;&nbsp;&nbsp;&nbsp;project :</p>
<p>* Try:<br />
&gt; Run with &#8211;stacktrace option to get the stack trace.<br />
&gt; Run with &#8211;info or &#8211;debug option to get more log output.<br />
&gt; Run with &#8211;scan to get full insights.<br />
&gt; Get more help at <a href="https://help.gradle.org" rel="nofollow ugc">https://help.gradle.org</a>.</p>
<p>BUILD FAILED in 40s<br />
Error: Gradle task assembleDebug failed with exit code 1</p>
]]></content:encoded>
		
			</item>
		<item>
		<title>
		By: dharshini		</title>
		<link>https://www.bestdevops.com/how-to-solve-error-failurebuild-failed-with-an-exception-in-android-studio/#comment-4085</link>

		<dc:creator><![CDATA[dharshini]]></dc:creator>
		<pubDate>Fri, 31 Jan 2025 12:47:36 +0000</pubDate>
		<guid isPermaLink="false">https://www.bestdevops.com/?p=28388#comment-4085</guid>

					<description><![CDATA[FAILURE: Build failed with an exception.

* What went wrong:
A problem occurred configuring root project &#039;android&#039;.
&#062; Could not resolve all files for configuration &#039;:classpath&#039;.
&#160;&#160;&#062; Could not find com.android.tools.build:gradle:8.3.
&#160;&#160;&#160;Searched in the following locations:
&#160;&#160;&#160;&#160;- https://dl.google.com/dl/android/maven2/com/android/tools/build/gradle/8.3/gradle-8.3.pom
&#160;&#160;&#160;&#160;- https://repo.maven.apache.org/maven2/com/android/tools/build/gradle/8.3/gradle-8.3.pom
&#160;&#160;&#160;Required by:
&#160;&#160;&#160;&#160;&#160;project :

* Try:
&#062; Run with --stacktrace option to get the stack trace.
&#062; Run with --info or --debug option to get more log output.
&#062; Run with --scan to get full insights.
&#062; Get more help at https://help.gradle.org.

BUILD FAILED in 8s
Error: Gradle task assembleDebug failed with exit code 1]]></description>
			<content:encoded><![CDATA[<p>FAILURE: Build failed with an exception.</p>
<p>* What went wrong:<br />
A problem occurred configuring root project &#8216;android&#8217;.<br />
&gt; Could not resolve all files for configuration &#8216;:classpath&#8217;.<br />
&nbsp;&nbsp;&gt; Could not find com.android.tools.build:gradle:8.3.<br />
&nbsp;&nbsp;&nbsp;Searched in the following locations:<br />
&nbsp;&nbsp;&nbsp;&nbsp;&#8211; <a href="https://dl.google.com/dl/android/maven2/com/android/tools/build/gradle/8.3/gradle-8.3.pom" rel="nofollow ugc">https://dl.google.com/dl/android/maven2/com/android/tools/build/gradle/8.3/gradle-8.3.pom</a><br />
&nbsp;&nbsp;&nbsp;&nbsp;&#8211; <a href="https://repo.maven.apache.org/maven2/com/android/tools/build/gradle/8.3/gradle-8.3.pom" rel="nofollow ugc">https://repo.maven.apache.org/maven2/com/android/tools/build/gradle/8.3/gradle-8.3.pom</a><br />
&nbsp;&nbsp;&nbsp;Required by:<br />
&nbsp;&nbsp;&nbsp;&nbsp;&nbsp;project :</p>
<p>* Try:<br />
&gt; Run with &#8211;stacktrace option to get the stack trace.<br />
&gt; Run with &#8211;info or &#8211;debug option to get more log output.<br />
&gt; Run with &#8211;scan to get full insights.<br />
&gt; Get more help at <a href="https://help.gradle.org" rel="nofollow ugc">https://help.gradle.org</a>.</p>
<p>BUILD FAILED in 8s<br />
Error: Gradle task assembleDebug failed with exit code 1</p>
]]></content:encoded>
		
			</item>
	</channel>
</rss>
